PREFIX,FIRST_NAME,MIDDLE_NAME,LAST_NAME,SUFFIX,ADDRESS1,ADDRESS2,STREET_NUMB,STREET_PRE_DRCT,STREET_NAME,STREET_SUFFIX,STREET_POST_DRCT,UNIT_DESG,UNIT_NUMB,CITY_ST_ZIP_ZIP4,CITY,STATE,ZIP,ZIP4,CRRT,DPBC,FIPS_STATE,FIPS_COUNTY,BLOCK_TRACT,COUNTY,RRC,DWELLING_TYPE,NCOA_MOVE_UPDATE_METHOD_CODE,NCOA_MOVE_UPDATE_DATE,MRTG_PRCH_DATE,SWIMMING_POOL
,Jeffrey,T,Logan,,728 Eagle Lake Ct,,728,,Eagle Lake,Ct,,,,Allen TX 75002-4820,Allen,TX,75002,4820,R030,282,48,85,314082,Collin,1,S,2,20131219,20131014,Y
Mr,Curtis,W,Socha,,5609 Pembroke Ct,,5609,,Pembroke,Ct,,,,Allen TX 75002-5439,Allen,TX,75002,5439,R027,96,48,85,313134,Collin,1,S,2,20131219,20131022,Y
,Larry,D,Corley,,806 Fall Dr,,806,,Fall,Dr,,,,Allen TX 75002-5058,Allen,TX,75002,5058,C009,62,48,85,314091,Collin,1,S,2,20131219,20131001,Y
Ms,Deanne,D,Clark,,4902 Shady Knolls Dr,,4902,,Shady Knolls,Dr,,,,Allen TX 75002-2728,Allen,TX,75002,2728,R015,25,48,85,314111,Collin,1,S,2,20131219,20131001,Y
,Joe,,Huff,,1108 Springfield Ln,,1108,,Springfield,Ln,,,,Allen TX 75002-2325,Allen,TX,75002,2325,C013,86,48,85,315042,Collin,1,S,2,20131220,20131104,Y
Mr,Michael,C,Vermeer,,5804 Hathaway Dr,,5804,,Hathaway,Dr,,,,Allen TX 75002-5425,Allen,TX,75002,5425,R027,46,48,85,313134,Collin,1,S,2,20131219,20131008,Y
,Rick,Y,Zheng,,314 Greenleaf Ct,,314,,Greenleaf,Ct,,,,Allen TX 75002-0620,Allen,TX,75002,620,R035,143,48,85,314068,Collin,1,S,2,20131219,20131111,Y
,James,T,Henderson,,1307 Rocky Creek Ln,,1307,,Rocky Creek,Ln,,,,Allen TX 75002-2936,Allen,TX,75002,2936,C013,79,48,85,315043,Collin,1,S,2,20131219,20131101,Y
,Robert,P,Letizia,,811 Water Oak Dr,,811,,Water Oak,Dr,,,,Allen TX 75002-6371,Allen,TX,75002,6371,R023,117,48,85,314112,Collin,1,S,2,20131219,20131030,Y
,Christopher,D,Griffith,,213 Willow Creek Cir,,213,,Willow Creek,Cir,,,,Allen TX 75002-3509,Allen,TX,75002,3509,C016,135,48,85,315061,Collin,1,S,2,20131219,20131015,Y
Mr,Christopher,C,Chase,,409 Fountain Gate Dr,,409,,Fountain Gate,Dr,,,,Allen TX 75002-2351,Allen,TX,75002,2351,C013,96,48,85,315042,Collin,1,S,2,20131219,20131115,Y
,Olivia,,Goldsmith,,914 Fairlawn St,,914,,Fairlawn,St,,,,Allen TX 75002-5049,Allen,TX,75002,5049,C009,143,48,85,314091,Collin,1,S,2,20131219,20131107,Y
Mr,Jerry,L,Blanford,,6 Janna Way,,6,,Janna,Way,,,,Allen TX 75002-7112,Allen,TX,75002,7112,R003,69,48,85,313134,Collin,1,S,2,20131219,20131016,Y
,Scott,,Yarberry,,6006 Rathbone Dr,,6006,,Rathbone,Dr,,,,Allen TX 75002-5444,Allen,TX,75002,5444,R027,63,48,85,313134,Collin,1,S,2,20131219,20131114,Y
Mr,Kevin,I,Phillips,,2 Jeremy Ct,,2,,Jeremy,Ct,,,,Allen TX 75002-4640,Allen,TX,75002,4640,R030,20,48,85,314082,Collin,1,S,2,20131219,20131002,Y
,Michael,,Farley,,1303 Creekwood Ct,,1303,,Creekwood,Ct,,,,Allen TX 75002-2909,Allen,TX,75002,2909,C006,33,48,85,315044,Collin,1,S,2,20131219,20131127,Y
,Chris,,Thom,,1301 Crestview Dr,,1301,,Crestview,Dr,,,,Allen TX 75002-2918,Allen,TX,75002,2918,C006,15,48,85,315043,Collin,1,S,2,20131219,20131105,Y
Mr,Jesse,D,Gray,III,1510 Pecan Ct,,1510,,Pecan,Ct,,,,Allen TX 75002-4325,Allen,TX,75002,4325,C011,101,48,85,314093,Collin,1,S,2,20131219,20131021,Y
Ms,Claudia,M,Heinrich-Barna,,2745 Stallion Dr,,2745,,Stallion,Dr,,,,Allen TX 75002-1023,Allen,TX,75002,1023,R005,451,48,85,314072,Collin,1,S,2,20131219,20131028,Y
,Gary,,Helmke,,1407 Woodmont Dr,,1407,,Woodmont,Dr,,,,Allen TX 75002-5872,Allen,TX,75002,5872,R012,77,48,85,314103,Collin,1,S,2,20131219,20131016,Y
,Jana,K,Diamond,,1105 Mistywood Ln,,1105,,Mistywood,Ln,,,,Allen TX 75002-2072,Allen,TX,75002,2072,C013,50,48,85,315041,Collin,1,S,2,20131219,20131101,Y
,Dillion,P,Anderton,,316 Canyon Springs Dr,,316,,Canyon Springs,Dr,,,,Allen TX 75002-0622,Allen,TX,75002,622,R035,169,48,85,314068,Collin,1,S,2,20131219,20131030,Y
,Nicholas,D,Magiera,,304 Watson Dr,,304,,Watson,Dr,,,,Allen TX 75002-3404,Allen,TX,75002,3404,C016,41,48,85,315061,Collin,1,S,2,20131219,20131017,Y
,Aimee,,Jostrand,,5 Orchard Rd,,5,,Orchard,Rd,,,,Allen TX 75002-8062,Allen,TX,75002,8062,R005,55,48,85,314072,Collin,1,S,2,20131219,20131028,Y
Ms,Leslie,L,Sullivan,,1528 Bethlehem Rd,,1528,,Bethlehem,Rd,,,,Allen TX 75002-5314,Allen,TX,75002,5314,R024,283,48,85,315083,Collin,1,S,2,20131219,20131113,Y
,Christopher,,Mickle,,5808 Corinth Chapel Rd,,5808,,Corinth Chapel,Rd,,,,Allen TX 75002-6447,Allen,TX,75002,6447,R027,87,48,85,313134,Collin,1,S,2,20131219,20131203,Y
Mr,Jeffrey,A,Arnold,Sr,1913 Saint Johns Ave,,1913,,Saint Johns,Ave,,,,Allen TX 75002-2653,Allen,TX,75002,2653,R031,136,48,85,314064,Collin,1,S,2,20131219,20131101,Y
,Laura,A,Wells,,1620 Mammoth Dr,,1620,,Mammoth,Dr,,,,Allen TX 75002-6459,Allen,TX,75002,6459,R023,200,48,85,314112,Collin,1,S,2,20131219,20131119,Y
,Stephen,,Harlan,,601 Ashby Pl,,601,,Ashby,Pl,,,,Allen TX 75002-4712,Allen,TX,75002,4712,C009,11,48,85,314091,Collin,1,S,2,20131219,20131125,Y
Mr,Donald,A,Hunter,,2409 Crown Ct,,2409,,Crown,Ct,,,,Carrollton TX 75006-2223,Carrollton,TX,75006,2223,C025,94,48,113,137211,Dallas,1,S,2,20131219,20131011,Y
,Angela,C,Carroccia,,2105 Woodcreek,,2105,,Woodcreek,,,,,Carrollton TX 75006-1941,Carrollton,TX,75006,1941,C028,52,48,113,137213,Dallas,1,S,2,20131219,20131016,Y
Mr,Karl,L,Morris,,2025 Saint Pierre Dr,,2025,,Saint Pierre,Dr,,,,Carrollton TX 75006-4342,Carrollton,TX,75006,4342,C032,252,48,113,207001,Dallas,1,S,2,20131219,20131119,Y
Mr,Rick,L,Martin,,2222 Cedar Cir,,2222,,Cedar,Cir,,,,Carrollton TX 75006-1913,Carrollton,TX,75006,1913,C041,224,48,113,137213,Dallas,1,S,2,20131219,20131025,Y
Mr,Jeffery,A,Frendle,,2721 Wagonwheel Dr,,2721,,Wagonwheel,Dr,,,,Carrollton TX 75006-4792,Carrollton,TX,75006,4792,C015,217,48,113,207003,Dallas,1,S,2,20131219,20131017,Y
Ms,Christine,D,Cooper,,2807 Carmel Dr,,2807,,Carmel,Dr,,,,Carrollton TX 75006-2655,Carrollton,TX,75006,2655,C021,77,48,113,137211,Dallas,1,S,2,20131219,20131101,Y
,Murray,,Hilyard,,2708 Carriage Ln,,2708,,Carriage,Ln,,,,Carrollton TX 75006-4732,Carrollton,TX,75006,4732,C031,88,48,113,207003,Dallas,1,S,2,20131219,20131122,Y
,Dennise,,Trevino,,2408 Princess Ct,,2408,,Princess,Ct,,,,Carrollton TX 75006-2228,Carrollton,TX,75006,2228,C025,80,48,113,137211,Dallas,1,S,2,20131219,20131015,Y
,Billy,D,Davis,,2315 Greenhill Dr,,2315,,Greenhill,Dr,,,,Carrollton TX 75006-1632,Carrollton,TX,75006,1632,C023,154,48,113,137202,Dallas,1,S,2,20131219,20131030,Y
,Edgar,A,Jimenez,,4107 Furneaux Ln,,4107,,Furneaux,Ln,,,,Carrollton TX 75007-1524,Carrollton,TX,75007,1524,C028,72,48,121,216333,Denton,1,S,2,20131219,20131106,Y
Mr,John,C,Plata,,4034 Windy Crest Cir,,4034,,Windy Crest,Cir,,,,Carrollton TX 75007-1518,Carrollton,TX,75007,1518,C028,349,48,121,216333,Denton,1,S,2,20131219,20131030,Y
Ms,Erica,,Figueroa,,1107 Cambridge Dr,,1107,,Cambridge,Dr,,,,Carrollton TX 75007-4873,Carrollton,TX,75007,4873,C004,72,48,113,137191,Dallas,1,S,2,20131219,20131024,Y
,Bruno,D,Goes,,1326 Ponderosa Pine Ln,,1326,,Ponderosa Pine,Ln,,,,Carrollton TX 75007-1028,Carrollton,TX,75007,1028,C028,262,48,121,216302,Denton,1,S,2,20131219,20131121,Y
Mr,Jared,W,Fricke,,3824 Grandview Dr,,3824,,Grandview,Dr,,,,Carrollton TX 75007-1938,Carrollton,TX,75007,1938,C002,244,48,121,216323,Denton,1,S,2,20131219,20131001,Y
,Michael,R,Braman,,2224 High Country Dr,,2224,,High Country,Dr,,,,Carrollton TX 75007-1704,Carrollton,TX,75007,1704,C005,243,48,121,216321,Denton,1,S,2,20131219,20131101,Y
,Saeyon,,Praisoody,,2810 Sausalito Dr,,2810,,Sausalito,Dr,,,,Carrollton TX 75007-5027,Carrollton,TX,75007,5027,C003,106,48,121,216111,Denton,1,S,2,20131219,20131028,Y
,Richard,D,Meriman,,1427 Charlotte Way,,1427,,Charlotte,Way,,,,Carrollton TX 75007-2772,Carrollton,TX,75007,2772,C048,274,48,121,216222,Denton,1,S,2,20131219,20131015,Y
,Amanda,P,Muir,,1905 Kensington Dr,,1905,,Kensington,Dr,,,,Carrollton TX 75007-2416,Carrollton,TX,75007,2416,C004,53,48,121,216332,Denton,1,S,2,20131219,20131024,Y
Mr,Ronnie,R,Brazell,,3702 Hay Meadow St,,3702,,Hay Meadow,St,,,,Celina TX 75009-5538,Celina,TX,75009,5538,R003,26,48,85,303053,Collin,1,S,2,20131219,20131105,Y
Mrs,Karen,E,Bradley,,4028 Preston Lakes Cir,,4028,,Preston Lakes,Cir,,,,Celina TX 75009-2283,Celina,TX,75009,2283,R001,284,48,85,303051,Collin,1,S,2,20131219,20131021,Y
